{"text_format":"3","workbook":"xlsx","n_sheets":3,"sheets":["Layer Body Weight (g)","Layer Body Weight (kg)","Standards"],"not_rendered":{"charts":4,"external_links":3,"defined_names":27},"read":"whole","date_system":"1900"}

{"sheet":"Layer Body Weight (g)","index":0,"n_rows":144,"n_cols":39,"rows_kept":144,"merged":[[0,8,0,10],[2,25,2,26],[35,3,35,24]]}
["Enter values in high-lighted yellow cells -- all other cells are calculated",{"$nulls":6},"Breed:","Hy-Line Pink"]
[]
[null,"Body weight. if there is no data, leave cells empty—do not enter a zero (0).",{"$nulls":14},"Standards will populate with breed selection",{"$nulls":5},"Breed",null,"Standards","Weekly wt. gain"]
[null,"g","Outside range",{"$nulls":14},"Count","g","kg","Unif %","CV%","Min",null,"Max","Standard","Actual",{"$nulls":7},"Hidden","Standard","Max","Min","Actual"]
[1,null,{"$f":"IF(B5=0,\"\",IF(B5=\"\",\"\",IF(B5>$J$8,\"High\",IF(B5<$J$9,\"Low\",\"\"))))","v":""},null,"Number of birds weighed",{"$nulls":4},{"$f":"COUNTIF(B5:B104,\">0\")","v":0},{"$nulls":6},"Week 15",{"$f":"E$38","v":0},{"$f":"E$39","v":0},{"$f":"S5/1000","v":{"v":0,"d":"0.000"}},{"$f":"E$40","v":{"v":0,"d":"0.0%"}},{"$f":"E$41","v":{"v":0,"d":"0.0%"}},{"$f":"IF($I$1=\"Hy-Line W-36\", Standards!K17, IF($I$1=\"Hy-Line Brown\", Standards!B17, IF($I$1=\"Hy-Line W-80\", Standards!T17, IF($I$1=\"Hy-Line Pink\", Standards!AC17, IF($I$1=\"Hy-Line Silver Brown\", Standards!AL17, IF($I$1=\"Hy-Line Sonia\", Standards!AU17, 0))))))","v":1310},{"$f":"IF($I$1=\"Hy-Line W-36\", Standards!L17, IF($I$1=\"Hy-Line Brown\", Standards!C17, IF($I$1=\"Hy-Line W-80\", Standards!U17, IF($I$1=\"Hy-Line Pink\", Standards!AD17, IF($I$1=\"Hy-Line Silver Brown\", Standards!AM17, IF($I$1=\"Hy-Line Sonia\", Standards!AV17, 0))))))","v":"–"},{"$f":"IF($I$1=\"Hy-Line W-36\", Standards!M17, IF($I$1=\"Hy-Line Brown\", Standards!D17, IF($I$1=\"Hy-Line W-80\", Standards!V17, IF($I$1=\"Hy-Line Pink\", Standards!AE17, IF($I$1=\"Hy-Line Silver Brown\", Standards!AN17, IF($I$1=\"Hy-Line Sonia\", Standards!AW17, 0))))))","v":1350},null,{"$f":"IF(S5>0, S5, NA())","v":{"$error":"#N/A"}},{"$nulls":6},15,{"$f":"IF(Y5>0, AL5, NA())","v":1310},{"$f":"IF(Y5>0, AK5-AL5, NA())","v":40},{"$f":"IF(Y5>0, Y5, NA())","v":1350},{"$f":"W5","v":1310},{"$f":"IF(S5>0, S5, NA())","v":{"$error":"#N/A"}}]
[{"$f":"1+A5","v":2},null,"",{"$nulls":13},"Week 16",{"$f":"F$38","v":0},{"$f":"F$39","v":0},{"$f":"S6/1000","v":{"v":0,"d":"0.000"}},{"$f":"F$40","v":{"v":0,"d":"0.0%"}},{"$f":"F$41","v":{"v":0,"d":"0.0%"}},{"$f":"IF($I$1=\"Hy-Line W-36\", Standards!K18, IF($I$1=\"Hy-Line Brown\", Standards!B18, IF($I$1=\"Hy-Line W-80\", Standards!T18, IF($I$1=\"Hy-Line Pink\", Standards!AC18, IF($I$1=\"Hy-Line Silver Brown\", Standards!AL18, IF($I$1=\"Hy-Line Sonia\", Standards!AU18, 0))))))","v":1380},null,{"$f":"IF($I$1=\"Hy-Line W-36\", Standards!M18, IF($I$1=\"Hy-Line Brown\", Standards!D18, IF($I$1=\"Hy-Line W-80\", Standards!V18, IF($I$1=\"Hy-Line Pink\", Standards!AE18, IF($I$1=\"Hy-Line Silver Brown\", Standards!AN18, IF($I$1=\"Hy-Line Sonia\", Standards!AW18, 0))))))","v":1420},{"$f":"IF(Y6>0, ((W6+Y6)/2)-((W5+Y5)/2), W6-W5)","v":70},{"$f":"IF(S6>0, S6-S5, NA())","v":{"$error":"#N/A"}},{"$nulls":6},16,{"$f":"IF(Y6>0, AL6, NA())","v":1380},{"$f":"IF(Y6>0, AK6-AL6, NA())","v":40},{"$f":"IF(Y6>0, Y6, NA())","v":1420},{"$f":"W6","v":1380},{"$f":"IF(S6>0, S6, NA())","v":{"$error":"#N/A"}}]
[{"$f":"1+A6","v":3},null,"",null,"Mean body weight",{"$nulls":4},{"$f":"IFERROR(AVERAGE(B5:B104), 0)","v":0},"g",{"$nulls":5},"Week 17",{"$f":"G$38","v":0},{"$f":"G$39","v":0},{"v":0,"d":"0.000"},{"$f":"G$40","v":{"v":0,"d":"0.0%"}},{"$f":"G$41","v":{"v":0,"d":"0.0%"}},{"$f":"IF($I$1=\"Hy-Line W-36\", Standards!K19, IF($I$1=\"Hy-Line Brown\", Standards!B19, IF($I$1=\"Hy-Line W-80\", Standards!T19, IF($I$1=\"Hy-Line Pink\", Standards!AC19, IF($I$1=\"Hy-Line Silver Brown\", Standards!AL19, IF($I$1=\"Hy-Line Sonia\", Standards!AU19, 0))))))","v":1440},null,{"$f":"IF($I$1=\"Hy-Line W-36\", Standards!M19, IF($I$1=\"Hy-Line Brown\", Standards!D19, IF($I$1=\"Hy-Line W-80\", Standards!V19, IF($I$1=\"Hy-Line Pink\", Standards!AE19, IF($I$1=\"Hy-Line Silver Brown\", Standards!AN19, IF($I$1=\"Hy-Line Sonia\", Standards!AW19, 0))))))","v":1480},{"$f":"IF(Y7>0, ((W7+Y7)/2)-((W6+Y6)/2), W7-W6)","v":60},{"$f":"IF(S7>0, S7-S6, NA())","v":{"$error":"#N/A"}},{"$nulls":6},17,1440,40,1480,1440,{"$error":"#N/A"}]
[4,null,"",null,"Mean + 10%",{"$nulls":4},{"$f":"IF(J7>0, ROUND(J7*1.1,3), 0)","v":0},"g",{"$nulls":5},"Week 18",{"$f":"H$38","v":0},{"$f":"H$39","v":0},{"v":0,"d":"0.000"},{"$f":"H$40","v":{"v":0,"d":"0.0%"}},{"$f":"H$41","v":{"v":0,"d":"0.0%"}},{"$f":"IF($I$1=\"Hy-Line W-36\", Standards!K20, IF($I$1=\"Hy-Line Brown\", Standards!B20, IF($I$1=\"Hy-Line W-80\", Standards!T20, IF($I$1=\"Hy-Line Pink\", Standards!AC20, IF($I$1=\"Hy-Line Silver Brown\", Standards!AL20, IF($I$1=\"Hy-Line Sonia\", Standards!AU20, 0))))))","v":1450},null,{"$f":"IF($I$1=\"Hy-Line W-36\", Standards!M20, IF($I$1=\"Hy-Line Brown\", Standards!D20, IF($I$1=\"Hy-Line W-80\", Standards!V20, IF($I$1=\"Hy-Line Pink\", Standards!AE20, IF($I$1=\"Hy-Line Silver Brown\", Standards!AN20, IF($I$1=\"Hy-Line Sonia\", Standards!AW20, 0))))))","v":1550},40,{"$error":"#N/A"},{"$nulls":6},18,1450,100,1550,1450,{"$error":"#N/A"}]
[5,null,"",null,"Mean – 10%",{"$nulls":4},{"$f":"ROUND(J7*0.9,3)","v":0},"g",{"$nulls":5},"Week 19",{"$f":"I$38","v":0},{"$f":"I$39","v":0},{"v":0,"d":"0.000"},{"$f":"I$40","v":{"v":0,"d":"0.0%"}},{"$f":"I$41","v":{"v":0,"d":"0.0%"}},{"$f":"IF($I$1=\"Hy-Line W-36\", Standards!K21, IF($I$1=\"Hy-Line Brown\", Standards!B21, IF($I$1=\"Hy-Line W-80\", Standards!T21, IF($I$1=\"Hy-Line Pink\", Standards!AC21, IF($I$1=\"Hy-Line Silver Brown\", Standards!AL21, IF($I$1=\"Hy-Line Sonia\", Standards!AU21, 0))))))","v":1490},null,{"$f":"IF($I$1=\"Hy-Line W-36\", Standards!M21, IF($I$1=\"Hy-Line Brown\", Standards!D21, IF($I$1=\"Hy-Line W-80\", Standards!V21, IF($I$1=\"Hy-Line Pink\", Standards!AE21, IF($I$1=\"Hy-Line Silver Brown\", Standards!AN21, IF($I$1=\"Hy-Line Sonia\", Standards!AW21, 0))))))","v":1600},45,{"$error":"#N/A"},{"$nulls":6},19,1490,110,1600,1490,{"$error":"#N/A"}]
[6,null,"",{"$nulls":13},"Week 20",{"$f":"J$38","v":0},{"$f":"J$39","v":0},{"v":0,"d":"0.000"},{"$f":"J$40","v":{"v":0,"d":"0.0%"}},{"$f":"J$41","v":{"v":0,"d":"0.0%"}},{"$f":"IF($I$1=\"Hy-Line W-36\", Standards!K22, IF($I$1=\"Hy-Line Brown\", Standards!B22, IF($I$1=\"Hy-Line W-80\", Standards!T22, IF($I$1=\"Hy-Line Pink\", Standards!AC22, IF($I$1=\"Hy-Line Silver Brown\", Standards!AL22, IF($I$1=\"Hy-Line Sonia\", Standards!AU22, 0))))))","v":1590},null,{"$f":"IF($I$1=\"Hy-Line W-36\", Standards!M22, IF($I$1=\"Hy-Line Brown\", Standards!D22, IF($I$1=\"Hy-Line W-80\", Standards!V22, IF($I$1=\"Hy-Line Pink\", Standards!AE22, IF($I$1=\"Hy-Line Silver Brown\", Standards!AN22, IF($I$1=\"Hy-Line Sonia\", Standards!AW22, 0))))))","v":1650},75,{"$error":"#N/A"},{"$nulls":6},20,1590,60,1650,1590,{"$error":"#N/A"}]
{"$rows_left_out":135}
{"sheet":"Layer Body Weight (kg)","index":1,"n_rows":144,"n_cols":39,"rows_kept":144,"merged":[[0,8,0,10],[2,25,2,26],[35,3,35,24]]}
["Enter values in high-lighted yellow cells -- all other cells are calculated",{"$nulls":6},"Breed:","Hy-Line Brown"]
[]
[null,"Body weight. if there is no data, leave cells empty—do not enter a zero (0).",{"$nulls":14},"Standards will populate with breed selection",{"$nulls":5},"Breed",null,"Standards","Weekly wt. gain"]
[null,"kg","Outside range",{"$nulls":14},"Count","kg","g","Unif %","CV%","Min",null,"Max","Standard","Actual",{"$nulls":7},"Hidden","Standard","Max","Min","Actual"]
[1,null,{"$f":"IF(B5=0,\"\",IF(B5=\"\",\"\",IF(B5>$J$8,\"High\",IF(B5<$J$9,\"Low\",\"\"))))","v":""},null,"Number of birds weighed",{"$nulls":4},{"$f":"COUNTIF(B5:B104,\">0\")","v":0},{"$nulls":6},"Week 15",{"$f":"E$38","v":0},{"$f":"E$39","v":{"v":0,"d":"0.000"}},{"$f":"S5*1000","v":0},{"$f":"E$40","v":{"v":0,"d":"0.0%"}},{"$f":"E$41","v":{"v":0,"d":"0.0%"}},{"$f":"IF($I$1=\"Hy-Line W-36\", Standards!O17, IF($I$1=\"Hy-Line Brown\", Standards!F17, IF($I$1=\"Hy-Line W-80\", Standards!X17, IF($I$1=\"Hy-Line Pink\", Standards!AG17, IF($I$1=\"Hy-Line Silver Brown\", Standards!AP17, IF($I$1=\"Hy-Line Sonia\", Standards!AY17, 0))))))","v":{"v":1.29,"d":"1.290"}},{"$f":"IF($I$1=\"Hy-Line W-36\", Standards!P17, IF($I$1=\"Hy-Line Brown\", Standards!G17, IF($I$1=\"Hy-Line W-80\", Standards!Y17, IF($I$1=\"Hy-Line Pink\", Standards!AH17, IF($I$1=\"Hy-Line Silver Brown\", Standards!AQ17, IF($I$1=\"Hy-Line Sonia\", Standards!AZ17, 0))))))","v":"–"},{"$f":"IF($I$1=\"Hy-Line W-36\", Standards!Q17, IF($I$1=\"Hy-Line Brown\", Standards!H17, IF($I$1=\"Hy-Line W-80\", Standards!Z17, IF($I$1=\"Hy-Line Pink\", Standards!AI17, IF($I$1=\"Hy-Line Silver Brown\", Standards!AR17, IF($I$1=\"Hy-Line Sonia\", Standards!BA17, 0))))))","v":{"v":1.36,"d":"1.360"}},null,{"$f":"IF(S5>0, S5, NA())","v":{"$error":"#N/A"}},{"$nulls":7},{"$f":"IF(Y5>0, AL5, NA())","v":{"v":1.29,"d":"1.290"}},{"$f":"IF(Y5>0, AK5-AL5, NA())","v":{"v":0.07000000000000006,"d":"0.070"}},{"$f":"IF(Y5>0, Y5, NA())","v":{"v":1.36,"d":"1.360"}},{"$f":"W5","v":{"v":1.29,"d":"1.290"}},{"$f":"IF(S5>0, S5, NA())","v":{"$error":"#N/A"}}]
[{"$f":"1+A5","v":2},null,"",{"$nulls":13},"Week 16",{"$f":"F$38","v":0},{"$f":"F$39","v":{"v":0,"d":"0.000"}},{"$f":"S6*1000","v":0},{"$f":"F$40","v":{"v":0,"d":"0.0%"}},{"$f":"F$41","v":{"v":0,"d":"0.0%"}},{"$f":"IF($I$1=\"Hy-Line W-36\", Standards!O18, IF($I$1=\"Hy-Line Brown\", Standards!F18, IF($I$1=\"Hy-Line W-80\", Standards!X18, IF($I$1=\"Hy-Line Pink\", Standards!AG18, IF($I$1=\"Hy-Line Silver Brown\", Standards!AP18, IF($I$1=\"Hy-Line Sonia\", Standards!AY18, 0))))))","v":{"v":1.36,"d":"1.360"}},{"$f":"IF($I$1=\"Hy-Line W-36\", Standards!P18, IF($I$1=\"Hy-Line Brown\", Standards!G18, IF($I$1=\"Hy-Line W-80\", Standards!Y18, IF($I$1=\"Hy-Line Pink\", Standards!AH18, IF($I$1=\"Hy-Line Silver Brown\", Standards!AQ18, IF($I$1=\"Hy-Line Sonia\", Standards!AZ18, 0))))))","v":"–"},{"$f":"IF($I$1=\"Hy-Line W-36\", Standards!Q18, IF($I$1=\"Hy-Line Brown\", Standards!H18, IF($I$1=\"Hy-Line W-80\", Standards!Z18, IF($I$1=\"Hy-Line Pink\", Standards!AI18, IF($I$1=\"Hy-Line Silver Brown\", Standards!AR18, IF($I$1=\"Hy-Line Sonia\", Standards!BA18, 0))))))","v":{"v":1.43,"d":"1.430"}},{"$f":"IF(Y6>0, ((W6+Y6)/2)-((W5+Y5)/2), W6-W5)","v":{"v":0.06999999999999984,"d":"0.070"}},{"$f":"IF(S6>0, S6-S5, NA())","v":{"$error":"#N/A"}},{"$nulls":7},{"$f":"IF(Y6>0, AL6, NA())","v":{"v":1.36,"d":"1.360"}},{"$f":"IF(Y6>0, AK6-AL6, NA())","v":{"v":0.06999999999999984,"d":"0.070"}},{"$f":"IF(Y6>0, Y6, NA())","v":{"v":1.43,"d":"1.430"}},{"$f":"W6","v":{"v":1.36,"d":"1.360"}},{"$f":"IF(S6>0, S6, NA())","v":{"$error":"#N/A"}}]
[{"$f":"1+A6","v":3},null,"",null,"Mean body weight",{"$nulls":4},{"$f":"IFERROR(AVERAGE(B5:B104), 0)","v":{"v":0,"d":"0.000"}},"kg",{"$nulls":5},"Week 17",{"$f":"G$38","v":0},{"$f":"G$39","v":{"v":0,"d":"0.000"}},0,{"$f":"G$40","v":{"v":0,"d":"0.0%"}},{"$f":"G$41","v":{"v":0,"d":"0.0%"}},{"$f":"IF($I$1=\"Hy-Line W-36\", Standards!O19, IF($I$1=\"Hy-Line Brown\", Standards!F19, IF($I$1=\"Hy-Line W-80\", Standards!X19, IF($I$1=\"Hy-Line Pink\", Standards!AG19, IF($I$1=\"Hy-Line Silver Brown\", Standards!AP19, IF($I$1=\"Hy-Line Sonia\", Standards!AY19, 0))))))","v":{"v":1.42,"d":"1.420"}},{"$f":"IF($I$1=\"Hy-Line W-36\", Standards!P19, IF($I$1=\"Hy-Line Brown\", Standards!G19, IF($I$1=\"Hy-Line W-80\", Standards!Y19, IF($I$1=\"Hy-Line Pink\", Standards!AH19, IF($I$1=\"Hy-Line Silver Brown\", Standards!AQ19, IF($I$1=\"Hy-Line Sonia\", Standards!AZ19, 0))))))","v":"–"},{"$f":"IF($I$1=\"Hy-Line W-36\", Standards!Q19, IF($I$1=\"Hy-Line Brown\", Standards!H19, IF($I$1=\"Hy-Line W-80\", Standards!Z19, IF($I$1=\"Hy-Line Pink\", Standards!AI19, IF($I$1=\"Hy-Line Silver Brown\", Standards!AR19, IF($I$1=\"Hy-Line Sonia\", Standards!BA19, 0))))))","v":{"v":1.5,"d":"1.500"}},{"$f":"IF(Y7>0, ((W7+Y7)/2)-((W6+Y6)/2), W7-W6)","v":{"v":0.06499999999999995,"d":"0.065"}},{"$f":"IF(S7>0, S7-S6, NA())","v":{"$error":"#N/A"}},{"$nulls":7},{"v":1.42,"d":"1.420"},{"v":0.08000000000000007,"d":"0.080"},{"v":1.5,"d":"1.500"},{"v":1.42,"d":"1.420"},{"$error":"#N/A"}]
[4,null,"",null,"Mean + 10%",{"$nulls":4},{"$f":"IF(J7>0, ROUND(J7*1.1,3), 0)","v":{"v":0,"d":"0.000"}},"kg",{"$nulls":5},"Week 18",{"$f":"H$38","v":0},{"$f":"H$39","v":{"v":0,"d":"0.000"}},0,{"$f":"H$40","v":{"v":0,"d":"0.0%"}},{"$f":"H$41","v":{"v":0,"d":"0.0%"}},{"$f":"IF($I$1=\"Hy-Line W-36\", Standards!O20, IF($I$1=\"Hy-Line Brown\", Standards!F20, IF($I$1=\"Hy-Line W-80\", Standards!X20, IF($I$1=\"Hy-Line Pink\", Standards!AG20, IF($I$1=\"Hy-Line Silver Brown\", Standards!AP20, IF($I$1=\"Hy-Line Sonia\", Standards!AY20, 0))))))","v":{"v":1.49,"d":"1.490"}},{"$f":"IF($I$1=\"Hy-Line W-36\", Standards!P20, IF($I$1=\"Hy-Line Brown\", Standards!G20, IF($I$1=\"Hy-Line W-80\", Standards!Y20, IF($I$1=\"Hy-Line Pink\", Standards!AH20, IF($I$1=\"Hy-Line Silver Brown\", Standards!AQ20, IF($I$1=\"Hy-Line Sonia\", Standards!AZ20, 0))))))","v":"–"},{"$f":"IF($I$1=\"Hy-Line W-36\", Standards!Q20, IF($I$1=\"Hy-Line Brown\", Standards!H20, IF($I$1=\"Hy-Line W-80\", Standards!Z20, IF($I$1=\"Hy-Line Pink\", Standards!AI20, IF($I$1=\"Hy-Line Silver Brown\", Standards!AR20, IF($I$1=\"Hy-Line Sonia\", Standards!BA20, 0))))))","v":{"v":1.61,"d":"1.610"}},{"v":0.09000000000000008,"d":"0.090"},{"$error":"#N/A"},{"$nulls":7},{"v":1.49,"d":"1.490"},{"v":0.1200000000000001,"d":"0.120"},{"v":1.61,"d":"1.610"},{"v":1.49,"d":"1.490"},{"$error":"#N/A"}]
[5,null,"",null,"Mean – 10%",{"$nulls":4},{"$f":"ROUND(J7*0.9,3)","v":{"v":0,"d":"0.000"}},"kg",{"$nulls":5},"Week 19",{"$f":"I$38","v":0},{"$f":"I$39","v":{"v":0,"d":"0.000"}},0,{"$f":"I$40","v":{"v":0,"d":"0.0%"}},{"$f":"I$41","v":{"v":0,"d":"0.0%"}},{"$f":"IF($I$1=\"Hy-Line W-36\", Standards!O21, IF($I$1=\"Hy-Line Brown\", Standards!F21, IF($I$1=\"Hy-Line W-80\", Standards!X21, IF($I$1=\"Hy-Line Pink\", Standards!AG21, IF($I$1=\"Hy-Line Silver Brown\", Standards!AP21, IF($I$1=\"Hy-Line Sonia\", Standards!AY21, 0))))))","v":{"v":1.59,"d":"1.590"}},{"$f":"IF($I$1=\"Hy-Line W-36\", Standards!P21, IF($I$1=\"Hy-Line Brown\", Standards!G21, IF($I$1=\"Hy-Line W-80\", Standards!Y21, IF($I$1=\"Hy-Line Pink\", Standards!AH21, IF($I$1=\"Hy-Line Silver Brown\", Standards!AQ21, IF($I$1=\"Hy-Line Sonia\", Standards!AZ21, 0))))))","v":"–"},{"$f":"IF($I$1=\"Hy-Line W-36\", Standards!Q21, IF($I$1=\"Hy-Line Brown\", Standards!H21, IF($I$1=\"Hy-Line W-80\", Standards!Z21, IF($I$1=\"Hy-Line Pink\", Standards!AI21, IF($I$1=\"Hy-Line Silver Brown\", Standards!AR21, IF($I$1=\"Hy-Line Sonia\", Standards!BA21, 0))))))","v":{"v":1.7,"d":"1.700"}},{"v":0.09499999999999997,"d":"0.095"},{"$error":"#N/A"},{"$nulls":7},{"v":1.59,"d":"1.590"},{"v":0.10999999999999988,"d":"0.110"},{"v":1.7,"d":"1.700"},{"v":1.59,"d":"1.590"},{"$error":"#N/A"}]
[6,null,"",{"$nulls":13},"Week 20",{"$f":"J$38","v":0},{"$f":"J$39","v":{"v":0,"d":"0.000"}},0,{"$f":"J$40","v":{"v":0,"d":"0.0%"}},{"$f":"J$41","v":{"v":0,"d":"0.0%"}},{"$f":"IF($I$1=\"Hy-Line W-36\", Standards!O22, IF($I$1=\"Hy-Line Brown\", Standards!F22, IF($I$1=\"Hy-Line W-80\", Standards!X22, IF($I$1=\"Hy-Line Pink\", Standards!AG22, IF($I$1=\"Hy-Line Silver Brown\", Standards!AP22, IF($I$1=\"Hy-Line Sonia\", Standards!AY22, 0))))))","v":{"v":1.65,"d":"1.650"}},{"$f":"IF($I$1=\"Hy-Line W-36\", Standards!P22, IF($I$1=\"Hy-Line Brown\", Standards!G22, IF($I$1=\"Hy-Line W-80\", Standards!Y22, IF($I$1=\"Hy-Line Pink\", Standards!AH22, IF($I$1=\"Hy-Line Silver Brown\", Standards!AQ22, IF($I$1=\"Hy-Line Sonia\", Standards!AZ22, 0))))))","v":"–"},{"$f":"IF($I$1=\"Hy-Line W-36\", Standards!Q22, IF($I$1=\"Hy-Line Brown\", Standards!H22, IF($I$1=\"Hy-Line W-80\", Standards!Z22, IF($I$1=\"Hy-Line Pink\", Standards!AI22, IF($I$1=\"Hy-Line Silver Brown\", Standards!AR22, IF($I$1=\"Hy-Line Sonia\", Standards!BA22, 0))))))","v":{"v":1.77,"d":"1.770"}},{"v":0.06499999999999995,"d":"0.065"},{"$error":"#N/A"},{"$nulls":7},{"v":1.65,"d":"1.650"},{"v":0.1200000000000001,"d":"0.120"},{"v":1.77,"d":"1.770"},{"v":1.65,"d":"1.650"},{"$error":"#N/A"}]
{"$rows_left_out":135}
{"sheet":"Standards","index":2,"n_rows":102,"n_cols":55,"rows_kept":102,"merged":[[0,1,0,7],[0,10,0,16],[0,19,0,25],[0,28,0,34],[0,37,0,43],[0,46,0,52]]}
["Age","Hy-Line Brown Commercial",{"$nulls":7},"Age","Hy-Line W-36 Commercial",{"$nulls":7},"Age","Hy-Line W-80 Commercial",{"$nulls":7},"Age","Hy-Line Pink",{"$nulls":7},"Age","Hy-Line Silver Brown",{"$nulls":7},"Age","Hy-Line Sonia",{"$nulls":7},"Click to use dropdown menu"]
["weeks","g","–","g",null,"kg","–","kg",null,"weeks","g","–","g",null,"kg","–","kg",null,"weeks","g","–","g",null,"kg","–","kg",null,"weeks","g","–","g",null,"kg","–","kg",null,"weeks","g","–","g",null,"kg","–","kg",null,"weeks","g","–","g",null,"kg","–","kg",null,"Hy-Line Brown"]
[1,{"$f":"SUM(F3*1000)","v":60},"–",{"$f":"SUM(H3*1000)","v":70},null,{"v":0.06,"d":"0.060"},"–",{"v":0.07,"d":"0.070"},null,1,60,"–",73,null,{"$f":"K3/1000","v":{"v":0.06,"d":"0.060"}},"–",{"$f":"M3/1000","v":0.073},null,1,{"$f":"SUM(X3*1000)","v":70},"–",{"$f":"SUM(Z3*1000)","v":80},null,{"v":0.07,"d":"0.070"},"–",{"v":0.08,"d":"0.080"},null,1,{"$f":"SUM(AG3*1000)","v":70},"–",{"$f":"SUM(AI3*1000)","v":80},null,{"v":0.07,"d":"0.070"},"–",{"v":0.08,"d":"0.080"},null,1,{"$f":"SUM(AP3*1000)","v":70},"–",{"$f":"SUM(AR3*1000)","v":80},null,{"v":0.07,"d":"0.070"},"–",{"v":0.08,"d":"0.080"},null,1,{"$f":"SUM(AY3*1000)","v":70},"–",{"$f":"SUM(BA3*1000)","v":80},null,{"v":0.07,"d":"0.070"},"–",{"v":0.08,"d":"0.080"},null,"Hy-Line W-36"]
[2,{"$f":"SUM(F4*1000)","v":120},"–",{"$f":"SUM(H4*1000)","v":130},null,{"v":0.12,"d":"0.120"},"–",{"v":0.13,"d":"0.130"},null,2,100,"–",118,null,{"$f":"K4/1000","v":{"v":0.1,"d":"0.100"}},"–",{"$f":"M4/1000","v":0.118},null,2,{"$f":"SUM(X4*1000)","v":120},"–",{"$f":"SUM(Z4*1000)","v":130},null,{"v":0.12,"d":"0.120"},"–",{"v":0.13,"d":"0.130"},null,2,{"$f":"SUM(AG4*1000)","v":110},"–",{"$f":"SUM(AI4*1000)","v":120},null,{"v":0.11,"d":"0.110"},"–",{"v":0.12,"d":"0.120"},null,2,{"$f":"SUM(AP4*1000)","v":120},"–",{"$f":"SUM(AR4*1000)","v":130},null,{"v":0.12,"d":"0.120"},"–",{"v":0.13,"d":"0.130"},null,2,{"$f":"SUM(AY4*1000)","v":110},"–",{"$f":"SUM(BA4*1000)","v":120},null,{"v":0.11,"d":"0.110"},"–",{"v":0.12,"d":"0.120"},null,"Hy-Line W-80"]
[3,180,"–",200,null,{"v":0.18,"d":"0.180"},"–",{"v":0.2,"d":"0.200"},null,3,150,"–",181,null,{"v":0.15,"d":"0.150"},"–",0.181,null,3,180,"–",190,null,{"v":0.18,"d":"0.180"},"–",{"v":0.19,"d":"0.190"},null,3,190,"–",200,null,{"v":0.19,"d":"0.190"},"–",{"v":0.2,"d":"0.200"},null,3,180,"–",200,null,{"v":0.18,"d":"0.180"},"–",{"v":0.2,"d":"0.200"},null,3,190,"–",200,null,{"v":0.19,"d":"0.190"},"–",{"v":0.2,"d":"0.200"},null,"Hy-Line Silver Brown"]
[4,260,"–",290,null,{"v":0.26,"d":"0.260"},"–",{"v":0.29,"d":"0.290"},null,4,200,"–",259,null,{"v":0.2,"d":"0.200"},"–",0.259,null,4,250,"–",260,null,{"v":0.25,"d":"0.250"},"–",{"v":0.26,"d":"0.260"},null,4,280,"–",290,null,{"v":0.28,"d":"0.280"},"–",{"v":0.29,"d":"0.290"},null,4,280,"–",290,null,{"v":0.28,"d":"0.280"},"–",{"v":0.29,"d":"0.290"},null,4,280,"–",290,null,{"v":0.28,"d":"0.280"},"–",{"v":0.29,"d":"0.290"},null,"Hy-Line Sonia"]
[5,350,"–",380,null,{"v":0.35,"d":"0.350"},"–",{"v":0.38,"d":"0.380"},null,5,290,"–",349,null,{"v":0.29,"d":"0.290"},"–",0.349,null,5,320,"–",350,null,{"v":0.32,"d":"0.320"},"–",{"v":0.35,"d":"0.350"},null,5,370,"–",390,null,{"v":0.37,"d":"0.370"},"–",{"v":0.39,"d":"0.390"},null,5,370,"–",390,null,{"v":0.37,"d":"0.370"},"–",{"v":0.39,"d":"0.390"},null,5,380,"–",390,null,{"v":0.38,"d":"0.380"},"–",{"v":0.39,"d":"0.390"},null,"Hy-Line Pink"]
[6,460,"–",480,null,{"v":0.46,"d":"0.460"},"–",{"v":0.48,"d":"0.480"},null,6,372,"–",440,null,0.372,"–",{"v":0.44,"d":"0.440"},null,6,410,"–",440,null,{"v":0.41,"d":"0.410"},"–",{"v":0.44,"d":"0.440"},null,6,480,"–",500,null,{"v":0.48,"d":"0.480"},"–",{"v":0.5,"d":"0.500"},null,6,470,"–",490,null,{"v":0.47,"d":"0.470"},"–",{"v":0.49,"d":"0.490"},null,6,490,"–",500,null,{"v":0.49,"d":"0.490"},"–",{"v":0.5,"d":"0.500"}]
[7,550,"–",590,null,{"v":0.55,"d":"0.550"},"–",{"v":0.59,"d":"0.590"},null,7,472,"–",531,null,0.472,"–",0.531,null,7,510,"–",550,null,{"v":0.51,"d":"0.510"},"–",{"v":0.55,"d":"0.550"},null,7,580,"–",600,null,{"v":0.58,"d":"0.580"},"–",{"v":0.6,"d":"0.600"},null,7,570,"–",610,null,{"v":0.57,"d":"0.570"},"–",{"v":0.61,"d":"0.610"},null,7,590,"–",600,null,{"v":0.59,"d":"0.590"},"–",{"v":0.6,"d":"0.600"}]
[8,660,"–",710,null,{"v":0.66,"d":"0.660"},"–",{"v":0.71,"d":"0.710"},null,8,549,"–",621,null,0.549,"–",0.621,null,8,600,"–",650,null,{"v":0.6,"d":"0.600"},"–",{"v":0.65,"d":"0.650"},null,8,700,"–",720,null,{"v":0.7,"d":"0.700"},"–",{"v":0.72,"d":"0.720"},null,8,680,"–",720,null,{"v":0.68,"d":"0.680"},"–",{"v":0.72,"d":"0.720"},null,8,710,"–",720,null,{"v":0.71,"d":"0.710"},"–",{"v":0.72,"d":"0.720"}]
{"$rows_left_out":92}